{"text_format":"3","workbook":"xlsx","n_sheets":18,"sheets":["Instructions","Main","Data","30-yr","Addnl Info","Budget Sum","Thermometer","Chart - Expenses","Chart - FP","Chart - Cash","Chart - %","Solver","Coding-F","Coding-B","Output-F","Output-B","SA Risk","wksCommandBars"],"not_rendered":{"charts":12,"images":4,"macros":1,"defined_names":187,"comments":1},"unopened":[{"sheet":"Chart - Expenses","index":7,"reason":"not_a_worksheet"},{"sheet":"Chart - FP","index":8,"reason":"not_a_worksheet"},{"sheet":"Chart - Cash","index":9,"reason":"not_a_worksheet"},{"sheet":"Chart - %","index":10,"reason":"not_a_worksheet"}],"read":"whole","date_system":"1900"}

{"sheet":"Instructions","index":0,"n_rows":25,"n_cols":3,"rows_kept":25}
[]
[null,"ARInc Reserves Analysis Spreadsheet!"]
[null,{"$f":"Main!D7","v":"Analysis File V4.1, 9/14"}]
[]
[]
[]
{"$rows_left_out":20}
{"sheet":"Main","index":1,"n_rows":91,"n_cols":6,"rows_kept":91,"merged":[[15,4,15,5],[50,2,50,5]]}
[]
[]
[]
[]
[]
[]
{"$rows_left_out":79}
{"sheet":"Data","index":2,"n_rows":79,"n_cols":161,"rows_kept":79,"merged":[[28,9,28,10],[28,23,28,24]]}
[]
[{"$nulls":52},"Year Increment",0,1,2,3,4,null,"Year Increment",5,6,7,8,9,null,"Year Increment",10,11,12,13,14,null,"Year Increment",15,16,17,18,19,null,"Year Increment",20,21,22,23,24,null,"Year Increment",25,26,27,28,29,30]
[{"$nulls":52},"Inflation",{"$f":"(1+Main!$D$22)^BB2","v":{"v":1,"d":"1.000"}},{"$f":"(1+Main!$D$22)^BC2","v":{"v":1.03,"d":"1.030"}},{"$f":"(1+Main!$D$22)^BD2","v":{"v":1.0609,"d":"1.061"}},{"$f":"(1+Main!$D$22)^BE2","v":{"v":1.092727,"d":"1.093"}},{"$f":"(1+Main!$D$22)^BF2","v":{"v":1.12550881,"d":"1.126"}},null,"Inflation",{"$f":"(1+Main!$D$22)^BI2","v":{"v":1.1592740742999998,"d":"1.159"}},{"$f":"(1+Main!$D$22)^BJ2","v":{"v":1.194052296529,"d":"1.194"}},{"$f":"(1+Main!$D$22)^BK2","v":{"v":1.22987386542487,"d":"1.230"}},{"$f":"(1+Main!$D$22)^BL2","v":{"v":1.266770081387616,"d":"1.267"}},{"$f":"(1+Main!$D$22)^BM2","v":{"v":1.3047731838292445,"d":"1.305"}},null,"Inflation",{"$f":"(1+Main!$D$22)^BP2","v":{"v":1.3439163793441218,"d":"1.344"}},{"$f":"(1+Main!$D$22)^BQ2","v":{"v":1.3842338707244455,"d":"1.384"}},{"$f":"(1+Main!$D$22)^BR2","v":{"v":1.4257608868461786,"d":"1.426"}},{"$f":"(1+Main!$D$22)^BS2","v":{"v":1.468533713451564,"d":"1.469"}},{"$f":"(1+Main!$D$22)^BT2","v":{"v":1.512589724855111,"d":"1.513"}},null,"Inflation",{"$f":"(1+Main!$D$22)^BW2","v":{"v":1.5579674166007644,"d":"1.558"}},{"$f":"(1+Main!$D$22)^BX2","v":{"v":1.604706439098787,"d":"1.605"}},{"$f":"(1+Main!$D$22)^BY2","v":{"v":1.6528476322717507,"d":"1.653"}},{"$f":"(1+Main!$D$22)^BZ2","v":{"v":1.7024330612399032,"d":"1.702"}},{"$f":"(1+Main!$D$22)^CA2","v":{"v":1.7535060530771003,"d":"1.754"}},null,"Inflation",{"$f":"(1+Main!$D$22)^CD2","v":{"v":1.8061112346694133,"d":"1.806"}},{"$f":"(1+Main!$D$22)^CE2","v":{"v":1.8602945717094954,"d":"1.860"}},{"$f":"(1+Main!$D$22)^CF2","v":{"v":1.9161034088607805,"d":"1.916"}},{"$f":"(1+Main!$D$22)^CG2","v":{"v":1.973586511126604,"d":"1.974"}},{"$f":"(1+Main!$D$22)^CH2","v":{"v":2.032794106460402,"d":"2.033"}},null,"Inflation",{"$f":"(1+Main!$D$22)^CK2","v":{"v":2.093777929654214,"d":"2.094"}},{"$f":"(1+Main!$D$22)^CL2","v":{"v":2.1565912675438406,"d":"2.157"}},{"$f":"(1+Main!$D$22)^CM2","v":{"v":2.2212890055701555,"d":"2.221"}},{"$f":"(1+Main!$D$22)^CN2","v":{"v":2.28792767573726,"d":"2.288"}},{"$f":"(1+Main!$D$22)^CO2","v":{"v":2.3565655060093778,"d":"2.357"}},{"$f":"(1+Main!$D$22)^CP2","v":{"v":2.427262471189659,"d":"2.427"}}]
[{"$nulls":52},"Alt Contribution rate (total)",{"$f":"Main!$D48*Main!$D61*Main!$D31","v":{"v":49890,"d":"$49,890"}},{"$f":"IF(BC2<=Main!$D33,(Main!$D31*Main!$D48)*(1+Main!$D32),IF(BC2<=(Main!$D33+Main!$D35),(Main!$D31*Main!$D48)*(1+Main!$D34),(Main!$D31*Main!$D48)))","v":{"v":51386.700000000004,"d":"$51,387"}},{"$f":"IF(BD2<=Main!$D33,BC4*(1+Main!$D32),IF(BD2<=(Main!$D35),BC4*(1+Main!$D34),BC4))","v":{"v":52928.30100000001,"d":"$52,928"}},{"$f":"IF(BE2<=Main!$D33,BD4*(1+Main!$D32),IF(BE2<=(Main!$D35),BD4*(1+Main!$D34),BD4))","v":{"v":54516.15003000001,"d":"$54,516"}},{"$f":"IF(BF2<=Main!$D33,BE4*(1+Main!$D32),IF(BF2<=(Main!$D35),BE4*(1+Main!$D34),BE4))","v":{"v":56151.63453090001,"d":"$56,152"}},null,"Alt Contribution rate (total)",{"$f":"IF(BI2<=Main!$D33,BF4*(1+Main!$D32),IF(BI2<=(Main!$D35),BF4*(1+Main!$D34),BF4))","v":{"v":57836.183566827014,"d":"$57,836"}},{"$f":"IF(BJ2<=Main!$D33,BI4*(1+Main!$D32),IF(BJ2<=(Main!$D35),BI4*(1+Main!$D34),BI4))","v":{"v":59571.26907383183,"d":"$59,571"}},{"$f":"IF(BK2<=Main!$D33,BJ4*(1+Main!$D32),IF(BK2<=(Main!$D35),BJ4*(1+Main!$D34),BJ4))","v":{"v":61358.40714604678,"d":"$61,358"}},{"$f":"IF(BL2<=Main!$D33,BK4*(1+Main!$D32),IF(BL2<=(Main!$D35),BK4*(1+Main!$D34),BK4))","v":{"v":63199.15936042819,"d":"$63,199"}},{"$f":"IF(BM2<=Main!$D33,BL4*(1+Main!$D32),IF(BM2<=(Main!$D35),BL4*(1+Main!$D34),BL4))","v":{"v":65095.13414124103,"d":"$65,095"}},null,"Alt Contribution rate (total)",{"$f":"IF(BP2<=Main!$D33,BM4*(1+Main!$D32),IF(BP2<=(Main!$D35),BM4*(1+Main!$D34),BM4))","v":{"v":67047.98816547827,"d":"$67,048"}},{"$f":"IF(BQ2<=Main!$D33,BP4*(1+Main!$D32),IF(BQ2<=(Main!$D35),BP4*(1+Main!$D34),BP4))","v":{"v":68388.94792878783,"d":"$68,389"}},{"$f":"IF(BR2<=Main!$D33,BQ4*(1+Main!$D32),IF(BR2<=(Main!$D35),BQ4*(1+Main!$D34),BQ4))","v":{"v":69756.72688736359,"d":"$69,757"}},{"$f":"IF(BS2<=Main!$D33,BR4*(1+Main!$D32),IF(BS2<=(Main!$D35),BR4*(1+Main!$D34),BR4))","v":{"v":71151.86142511087,"d":"$71,152"}},{"$f":"IF(BT2<=Main!$D33,BS4*(1+Main!$D32),IF(BT2<=(Main!$D35),BS4*(1+Main!$D34),BS4))","v":{"v":72574.89865361308,"d":"$72,575"}},null,"Alt Contribution rate (total)",{"$f":"IF(BW2<=Main!$D33,BT4*(1+Main!$D32),IF(BW2<=(Main!$D35),BT4*(1+Main!$D34),BT4))","v":{"v":74026.39662668535,"d":"$74,026"}},{"$f":"IF(BX2<=Main!$D33,BW4*(1+Main!$D32),IF(BX2<=(Main!$D35),BW4*(1+Main!$D34),BW4))","v":{"v":75506.92455921906,"d":"$75,507"}},{"$f":"IF(BY2<=Main!$D33,BX4*(1+Main!$D32),IF(BY2<=(Main!$D35),BX4*(1+Main!$D34),BX4))","v":{"v":77017.06305040343,"d":"$77,017"}},{"$f":"IF(BZ2<=Main!$D33,BY4*(1+Main!$D32),IF(BZ2<=(Main!$D35),BY4*(1+Main!$D34),BY4))","v":{"v":78557.4043114115,"d":"$78,557"}},{"$f":"IF(CA2<=Main!$D33,BZ4*(1+Main!$D32),IF(CA2<=(Main!$D35),BZ4*(1+Main!$D34),BZ4))","v":{"v":80128.55239763974,"d":"$80,129"}},null,"Alt Contribution rate (total)",{"$f":"IF(CD2<=Main!$D33,CA4*(1+Main!$D32),IF(CD2<=(Main!$D35),CA4*(1+Main!$D34),CA4))","v":{"v":81731.12344559253,"d":"$81,731"}},{"$f":"IF(CE2<=Main!$D33,CD4*(1+Main!$D32),IF(CE2<=(Main!$D35),CD4*(1+Main!$D34),CD4))","v":{"v":83365.74591450438,"d":"$83,366"}},{"$f":"IF(CF2<=Main!$D33,CE4*(1+Main!$D32),IF(CF2<=(Main!$D35),CE4*(1+Main!$D34),CE4))","v":{"v":85033.06083279448,"d":"$85,033"}},{"$f":"IF(CG2<=Main!$D33,CF4*(1+Main!$D32),IF(CG2<=(Main!$D35),CF4*(1+Main!$D34),CF4))","v":{"v":86733.72204945037,"d":"$86,734"}},{"$f":"IF(CH2<=Main!$D33,CG4*(1+Main!$D32),IF(CH2<=(Main!$D35),CG4*(1+Main!$D34),CG4))","v":{"v":88468.39649043938,"d":"$88,468"}},null,"Alt Contribution rate (total)",{"$f":"IF(CK2<=Main!$D33,CH4*(1+Main!$D32),IF(CK2<=(Main!$D35),CH4*(1+Main!$D34),CH4))","v":{"v":90237.76442024818,"d":"$90,238"}},{"$f":"IF(CL2<=Main!$D33,CK4*(1+Main!$D32),IF(CL2<=(Main!$D35),CK4*(1+Main!$D34),CK4))","v":{"v":92042.51970865314,"d":"$92,043"}},{"$f":"IF(CM2<=Main!$D33,CL4*(1+Main!$D32),IF(CM2<=(Main!$D35),CL4*(1+Main!$D34),CL4))","v":{"v":93883.3701028262,"d":"$93,883"}},{"$f":"IF(CN2<=Main!$D33,CM4*(1+Main!$D32),IF(CN2<=(Main!$D35),CM4*(1+Main!$D34),CM4))","v":{"v":95761.03750488273,"d":"$95,761"}},{"$f":"IF(CO2<=Main!$D33,CN4*(1+Main!$D32),IF(CO2<=(Main!$D35),CN4*(1+Main!$D34),CN4))","v":{"v":97676.25825498038,"d":"$97,676"}},{"$f":"IF(CP2<=Main!$D33,CO4*(1+Main!$D32),IF(CP2<=(Main!$D35),CO4*(1+Main!$D34),CO4))","v":{"v":99629.78342007998,"d":"$99,630"}}]
[{"$nulls":52},"Alt Interest Earnings",{"$f":"IF((BB7+(BB4+BB26-BB77)/2)>0,(BB7+(BB4+BB26-BB77)/2)*Main!$D67,0)","v":{"v":4403.576633169393,"d":"$4,404"}},{"$f":"IF((BC7+(BC4+BC26-BC77)/2)>0,(BC7+(BC4+BC26-BC77)/2)*Main!$D67,0)","v":{"v":4585.520805247032,"d":"$4,586"}},{"$f":"IF((BD7+(BD4+BD26-BD77)/2)>0,(BD7+(BD4+BD26-BD77)/2)*Main!$D67,0)","v":{"v":4267.239863470611,"d":"$4,267"}},{"$f":"IF((BE7+(BE4+BE26-BE77)/2)>0,(BE7+(BE4+BE26-BE77)/2)*Main!$D67,0)","v":{"v":3859.160981341982,"d":"$3,859"}},{"$f":"IF((BF7+(BF4+BF26-BF77)/2)>0,(BF7+(BF4+BF26-BF77)/2)*Main!$D67,0)","v":{"v":4111.067313303113,"d":"$4,111"}},null,"Alt Interest Earnings",{"$f":"IF((BI7+(BI4+BI26-BI77)/2)>0,(BI7+(BI4+BI26-BI77)/2)*Main!$D67,0)","v":{"v":5078.636014368676,"d":"$5,079"}},{"$f":"IF((BJ7+(BJ4+BJ26-BJ77)/2)>0,(BJ7+(BJ4+BJ26-BJ77)/2)*Main!$D67,0)","v":{"v":6151.922048479134,"d":"$6,152"}},{"$f":"IF((BK7+(BK4+BK26-BK77)/2)>0,(BK7+(BK4+BK26-BK77)/2)*Main!$D67,0)","v":{"v":3200.6390051383273,"d":"$3,201"}},{"$f":"IF((BL7+(BL4+BL26-BL77)/2)>0,(BL7+(BL4+BL26-BL77)/2)*Main!$D67,0)","v":{"v":151.39379553357097,"d":"$151"}},{"$f":"IF((BM7+(BM4+BM26-BM77)/2)>0,(BM7+(BM4+BM26-BM77)/2)*Main!$D67,0)","v":{"v":536.1666705458937,"d":"$536"}},null,"Alt Interest Earnings",{"$f":"IF((BP7+(BP4+BP26-BP77)/2)>0,(BP7+(BP4+BP26-BP77)/2)*Main!$D67,0)","v":{"v":1015.1781051617965,"d":"$1,015"}},{"$f":"IF((BQ7+(BQ4+BQ26-BQ77)/2)>0,(BQ7+(BQ4+BQ26-BQ77)/2)*Main!$D67,0)","v":{"v":1507.1323043623843,"d":"$1,507"}},{"$f":"IF((BR7+(BR4+BR26-BR77)/2)>0,(BR7+(BR4+BR26-BR77)/2)*Main!$D67,0)","v":{"v":1781.1175525908327,"d":"$1,781"}},{"$f":"IF((BS7+(BS4+BS26-BS77)/2)>0,(BS7+(BS4+BS26-BS77)/2)*Main!$D67,0)","v":{"v":2030.117637195017,"d":"$2,030"}},{"$f":"IF((BT7+(BT4+BT26-BT77)/2)>0,(BT7+(BT4+BT26-BT77)/2)*Main!$D67,0)","v":{"v":2590.066936019112,"d":"$2,590"}},null,"Alt Interest Earnings",{"$f":"IF((BW7+(BW4+BW26-BW77)/2)>0,(BW7+(BW4+BW26-BW77)/2)*Main!$D67,0)","v":{"v":3044.6675141140267,"d":"$3,045"}},{"$f":"IF((BX7+(BX4+BX26-BX77)/2)>0,(BX7+(BX4+BX26-BX77)/2)*Main!$D67,0)","v":{"v":3414.740154400285,"d":"$3,415"}},{"$f":"IF((BY7+(BY4+BY26-BY77)/2)>0,(BY7+(BY4+BY26-BY77)/2)*Main!$D67,0)","v":{"v":3639.2532799431733,"d":"$3,639"}},{"$f":"IF((BZ7+(BZ4+BZ26-BZ77)/2)>0,(BZ7+(BZ4+BZ26-BZ77)/2)*Main!$D67,0)","v":{"v":2396.0265816481788,"d":"$2,396"}},{"$f":"IF((CA7+(CA4+CA26-CA77)/2)>0,(CA7+(CA4+CA26-CA77)/2)*Main!$D67,0)","v":{"v":1504.991793774171,"d":"$1,505"}},null,"Alt Interest Earnings",{"$f":"IF((CD7+(CD4+CD26-CD77)/2)>0,(CD7+(CD4+CD26-CD77)/2)*Main!$D67,0)","v":{"v":1994.9083269231517,"d":"$1,995"}},{"$f":"IF((CE7+(CE4+CE26-CE77)/2)>0,(CE7+(CE4+CE26-CE77)/2)*Main!$D67,0)","v":{"v":2309.960139474843,"d":"$2,310"}},{"$f":"IF((CF7+(CF4+CF26-CF77)/2)>0,(CF7+(CF4+CF26-CF77)/2)*Main!$D67,0)","v":{"v":2892.862984579023,"d":"$2,893"}},{"$f":"IF((CG7+(CG4+CG26-CG77)/2)>0,(CG7+(CG4+CG26-CG77)/2)*Main!$D67,0)","v":{"v":3460.271809965087,"d":"$3,460"}},{"$f":"IF((CH7+(CH4+CH26-CH77)/2)>0,(CH7+(CH4+CH26-CH77)/2)*Main!$D67,0)","v":{"v":3881.7158536149836,"d":"$3,882"}},null,"Alt Interest Earnings",{"$f":"IF((CK7+(CK4+CK26-CK77)/2)>0,(CK7+(CK4+CK26-CK77)/2)*Main!$D67,0)","v":{"v":3931.2446541582735,"d":"$3,931"}},{"$f":"IF((CL7+(CL4+CL26-CL77)/2)>0,(CL7+(CL4+CL26-CL77)/2)*Main!$D67,0)","v":{"v":4034.5926130951543,"d":"$4,035"}},{"$f":"IF((CM7+(CM4+CM26-CM77)/2)>0,(CM7+(CM4+CM26-CM77)/2)*Main!$D67,0)","v":{"v":3969.4132947391386,"d":"$3,969"}},{"$f":"IF((CN7+(CN4+CN26-CN77)/2)>0,(CN7+(CN4+CN26-CN77)/2)*Main!$D67,0)","v":{"v":3913.233202414593,"d":"$3,913"}},{"$f":"IF((CO7+(CO4+CO26-CO77)/2)>0,(CO7+(CO4+CO26-CO77)/2)*Main!$D67,0)","v":{"v":4420.186012337729,"d":"$4,420"}},{"$f":"IF((CP7+(CP4+CP26-CP77)/2)>0,(CP7+(CP4+CP26-CP77)/2)*Main!$D67,0)","v":{"v":4471.5109404408595,"d":"$4,472"}}]
[{"$nulls":52},"Alt Starting Balance (for charts)",{"$f":"Main!D20","v":{"v":444123,"d":"$444,123"}},{"$f":"IF(BB7+BB5+BB4+BB26-BB77>0,BB7+BB5+BB26+BB4-BB77,0)","v":{"v":436966.5766331694,"d":"$436,967"}},{"$f":"IF(BC7+BC5+BC4+BC26-BC77>0,BC7+BC5+BC26+BC4-BC77,0)","v":{"v":480527.2974384164,"d":"$480,527"}},{"$f":"IF(BD7+BD5+BD4+BD26-BD77>0,BD7+BD5+BD26+BD4-BD77,0)","v":{"v":373283.33830188704,"d":"$373,283"}},{"$f":"IF(BE7+BE5+BE4+BE26-BE77>0,BE7+BE5+BE26+BE4-BE77,0)","v":{"v":398876.839313229,"d":"$398,877"}},null,"Alt Starting Balance (for charts)",{"$f":"IF(BF7+BF5+BF4+BF26-BF77>0,BF7+BF5+BF4+BF26-BF77,0)","v":{"v":423686.01364243217,"d":"$423,686"}},{"$f":"IF(BI7+BI5+BI4+BI26-BI77>0,BI7+BI5+BI26+BI4-BI77,0)","v":{"v":592472.8109976777,"d":"$592,473"}},{"$f":"IF(BJ7+BJ5+BJ4+BJ26-BJ77>0,BJ7+BJ5+BJ26+BJ4-BJ77,0)","v":{"v":638434.4366124339,"d":"$638,434"}},{"$f":"IF(BK7+BK5+BK4+BK26-BK77>0,BK7+BK5+BK26+BK4-BK77,0)","v":{"v":1965.3794714430114,"d":"$1,965"}},{"$f":"IF(BL7+BL5+BL4+BL26-BL77>0,BL7+BL5+BL26+BL4-BL77,0)","v":{"v":28326.246250886383,"d":"$28,326"}},null,"Alt Starting Balance (for charts)",{"$f":"IF(BM7+BM5+BM4+BM26-BM77>0,BM7+BM5+BM4+BM26-BM77,0)","v":{"v":78952.655448637,"d":"$78,953"}},{"$f":"IF(BP7+BP5+BP4+BP26-BP77>0,BP7+BP5+BP26+BP4-BP77,0)","v":{"v":124169.243270427,"d":"$124,169"}},{"$f":"IF(BQ7+BQ5+BQ4+BQ26-BQ77>0,BQ7+BQ5+BQ26+BQ4-BQ77,0)","v":{"v":177385.30536134765,"d":"$177,385"}},{"$f":"IF(BR7+BR5+BR4+BR26-BR77>0,BR7+BR5+BR26+BR4-BR77,0)","v":{"v":178989.57830149698,"d":"$178,990"}},{"$f":"IF(BS7+BS5+BS4+BS26-BS77>0,BS7+BS5+BS26+BS4-BS77,0)","v":{"v":227206.48423512626,"d":"$227,206"}},null,"Alt Starting Balance (for charts)",{"$f":"IF(BT7+BT5+BT4+BT26-BT77>0,BT7+BT5+BT4+BT26-BT77,0)","v":{"v":291027.02688834514,"d":"$291,027"}},{"$f":"IF(BW7+BW5+BW4+BW26-BW77>0,BW7+BW5+BW26+BW4-BW77,0)","v":{"v":318165.23532708996,"d":"$318,165"}},{"$f":"IF(BX7+BX5+BX4+BX26-BX77>0,BX7+BX5+BX26+BX4-BX77,0)","v":{"v":365073.0065806885,"d":"$365,073"}},{"$f":"IF(BY7+BY5+BY4+BY26-BY77>0,BY7+BY5+BY26+BY4-BY77,0)","v":{"v":363086.94129744766,"d":"$363,087"}},{"$f":"IF(BZ7+BZ5+BZ4+BZ26-BZ77>0,BZ7+BZ5+BZ26+BZ4-BZ77,0)","v":{"v":116322.00790182594,"d":"$116,322"}},null,"Alt Starting Balance (for charts)",{"$f":"IF(CA7+CA5+CA4+CA26-CA77>0,CA7+CA5+CA4+CA26-CA77,0)","v":{"v":184804.2566951616,"d":"$184,804"}},{"$f":"IF(CD7+CD5+CD4+CD26-CD77>0,CD7+CD5+CD26+CD4-CD77,0)","v":{"v":214346.9514275949,"d":"$214,347"}},{"$f":"IF(CE7+CE5+CE4+CE26-CE77>0,CE7+CE5+CE26+CE4-CE77,0)","v":{"v":247841.39474512276,"d":"$247,841"}},{"$f":"IF(CF7+CF5+CF4+CF26-CF77>0,CF7+CF5+CF26+CF4-CF77,0)","v":{"v":330977.0600403443,"d":"$330,977"}},{"$f":"IF(CG7+CG5+CG4+CG26-CG77>0,CG7+CG5+CG26+CG4-CG77,0)","v":{"v":361371.3826126237,"d":"$361,371"}},null,"Alt Starting Balance (for charts)",{"$f":"IF(CH7+CH5+CH4+CH26-CH77>0,CH7+CH5+CH4+CH26-CH77,0)","v":{"v":415301.6863445764,"d":"$415,302"}},{"$f":"IF(CK7+CK5+CK4+CK26-CK77>0,CK7+CK5+CK26+CK4-CK77,0)","v":{"v":371281.35206180473,"d":"$371,281"}},{"$f":"IF(CL7+CL5+CL4+CL26-CL77>0,CL7+CL5+CL26+CL4-CL77,0)","v":{"v":435980.06144079013,"d":"$435,980"}},{"$f":"IF(CM7+CM5+CM4+CM26-CM77>0,CM7+CM5+CM26+CM4-CM77,0)","v":{"v":358239.94894803467,"d":"$358,240"}},{"$f":"IF(CN7+CN5+CN4+CN26-CN77>0,CN7+CN5+CN26+CN4-CN77,0)","v":{"v":424739.2683571417,"d":"$424,739"}},{"$f":"IF(CO7+CO5+CO4+CO26-CO77>0,CO7+CO5+CO26+CO4-CO77,0)","v":{"v":459673.5957031925,"d":"$459,674"}}]
{"$rows_left_out":74}
{"sheet":"30-yr","index":3,"n_rows":58,"n_cols":12,"rows_kept":58,"merged":[[5,1,5,3],[7,1,7,6],[7,8,8,11],[8,1,8,6],[10,5,10,6],[11,5,11,6],[12,5,12,6],[54,1,54,2],[55,1,55,2],[56,1,56,2],[57,1,57,2]]}
[]
[null,"Table 5:  30-Year Reserve Plan Summary",{"$nulls":9},{"$f":"Main!D10","v":"24907-1"}]
[]
[]
[]
[null,"Fiscal Year Start:",null,null,{"$f":"Main!StartDate","v":"2022-01-01"},{"$nulls":3},"Interest:",{"$f":"Main!InterestRate","v":{"v":0.01,"d":"1.0%"}},"Inflation:",{"$f":"Main!InflationRate","v":{"v":0.03,"d":"3.0%"}}]
{"$rows_left_out":43}
{"sheet":"Addnl Info","index":4,"n_rows":24,"n_cols":8,"rows_kept":24,"merged":[[0,1,0,7],[2,1,2,2],[4,1,4,7],[8,1,8,7],[9,1,9,7],[10,1,10,7],[11,1,11,7],[12,1,12,7],[16,1,16,7],[17,1,17,7],[18,1,18,7],[19,1,19,7],[20,1,20,7],[23,1,23,7],[24,1,24,7],[25,1,25,7],[26,1,26,7],[27,1,27,7],[28,1,28,7]]}
[null,{"$f":"#REF!","v":{"$error":"#REF!"}}]
[]
[null,"Association Name:",null,{"$f":"Main!D11","v":"Admiral's Cove Beach Club"},null,null,"#",{"$f":"Main!ClientNumber","v":"24907-1"}]
[]
[null,"Please enter additional information, as applicable, in the shaded spaces below"]
[]
{"$rows_left_out":19}
{"sheet":"Budget Sum","index":5,"n_rows":17,"n_cols":14,"rows_kept":17,"merged":[[7,4,7,5],[7,6,7,7],[17,8,17,10]]}
[{"$nulls":4},4,4,5,5,9,50,45,30,null,46]
[]
[null,null,"Reserve Budget Funding Summary"]
[null,null,{"$f":"Main!ClientNumber","v":"24907-1"},{"$f":"Main!ClientName","v":"Admiral's Cove Beach Club"}]
[]
[]
{"$rows_left_out":12}
{"sheet":"Thermometer","index":6,"n_rows":12,"n_cols":3,"rows_kept":12}
["X","Y","Labels"]
[0.15,-0.05,"High"]
[0.5,-0.05,"Medium"]
[1,-0.05,"Low"]
[1.5,-0.05]
[{"$f":"MIN(A11,C7)","v":0.9381558935361217},0.07,"Max Value"]
{"$rows_left_out":7}
{"sheet":"Solver","index":11,"n_rows":47,"n_cols":34,"rows_kept":47,"merged":[[0,2,0,3]]}
[1,null,"Initial Settings:",{"$nulls":6},"= administrator initial settings"]
[2,null,"Initial Contrib:",{"$f":"Data!AW77/12","v":{"v":37010.25,"d":"$37,010.25"}},"InitialContribution",{"$nulls":4},"= computed diagnostics used by solver"]
[3,null,"# of units",{"$f":"Main!NumUnits","v":500},"NumUnits"]
[4,null,"1AI & 2AI",{"v":0.03,"d":"3.00%"},"AnnualIncreasePct"]
[5,null,"1AIY & 2AIY",30,"AnnualIncreaseYears"]
[6,null,"Initial Cycle Contrib Change",{"v":0.01,"d":"1.00%"},"ContributionChangeCycle1",null,null,"Counters"]
{"$rows_left_out":42}
{"sheet":"Coding-F","index":12,"n_rows":199,"n_cols":5,"rows_kept":199}
["Note: all cell references refer to \"Solver\" worksheet unless otherwise designated"]
["Full Funding Solver"]
[]
["Start","set annual increases"]
[null,null,"Set 1AI = d4",null,"(1st ramp annual increase)"]
[null,null,"Set 1AIY = d5",null,"(1st ramp annual increase years)"]
{"$rows_left_out":194}
{"sheet":"Coding-B","index":13,"n_rows":127,"n_cols":12,"rows_kept":127}
["Note: all cell references refer to \"Solver\" worksheet unless otherwise designated"]
["Baseline Solver"]
[]
["Start","Set Cycle Counters"]
[null,null,"set cycle1 = 0"]
[null,null,"set cycle2 = 0"]
{"$rows_left_out":122}
{"sheet":"Output-F","index":14,"n_rows":17,"n_cols":8,"rows_kept":17}
["Cycle 2 #","Contrib","1AI Yrs","2AI %","Slope","% Funded","At the End of Branch","Last Operation"]
[null,{"v":57340.63,"d":"$57,341"},30,{"v":0.03,"d":"3.00%"},{"v":0.035190544721869374,"d":"3.52%"},{"v":1.020289663178266,"d":"102.03%"},"Cycle 2","Reset 2AI"]
[1,{"v":57340.63,"d":"$57,341"},25,{"v":0.024999999999999998,"d":"2.50%"},{"v":0.03434074946020271,"d":"3.43%"},{"v":1.0188494077634478,"d":"101.88%"},"Cycle 2 High Yr","No Boost or Trim"]
[2,{"v":57340.63,"d":"$57,341"},20,{"v":0.024999999999999998,"d":"2.50%"},{"v":0.031114504824015655,"d":"3.11%"},{"v":1.0051804835368496,"d":"100.52%"},"Cycle 2 High Yr","No Boost or Trim"]
[3,{"v":57340.63,"d":"$57,341"},15,{"v":0.024999999999999998,"d":"2.50%"},{"v":0.028029268199049363,"d":"2.80%"},{"v":0.976204437530555,"d":"97.62%"},"Cycle 2 High Yr","No Boost or Trim"]
[4,{"v":57340.63,"d":"$57,341"},10,{"v":0.024999999999999998,"d":"2.50%"},{"v":0.0252019859027121,"d":"2.52%"},{"v":0.9337461954596724,"d":"93.37%"},"Cycle 2 High Yr","No Boost or Trim"]
{"$rows_left_out":12}
{"sheet":"Output-B","index":15,"n_rows":44,"n_cols":9,"rows_kept":44}
["Loop #","Contrib","Special Assmt","Margin1","MinEndBalMargin","1AI Yrs","2AI %","Cycle #","Last Operation"]
[1,{"v":37380.35,"d":"$37,380"},{"v":0,"d":"$0.00"},false,{"v":-10.833231514079845,"d":"-1083.32%"},30,{"v":0.024999999999999998,"d":"2.50%"},"Cycle 1","Cycle1-low"]
[2,{"v":37754.16,"d":"$37,754"},{"v":0,"d":"$0.00"},false,{"v":-10.035714701888125,"d":"-1003.57%"},30,{"v":0.024999999999999998,"d":"2.50%"},"Cycle 1","Cycle1-low"]
[3,{"v":38131.7,"d":"$38,132"},{"v":0,"d":"$0.00"},false,{"v":-9.227205955100182,"d":"-922.72%"},30,{"v":0.024999999999999998,"d":"2.50%"},"Cycle 1","Cycle1-low"]
[4,{"v":38513.01,"d":"$38,513"},{"v":0,"d":"$0.00"},false,{"v":-8.407086363356855,"d":"-840.71%"},30,{"v":0.024999999999999998,"d":"2.50%"},"Cycle 1","Cycle1-low"]
[5,{"v":38898.14,"d":"$38,898"},{"v":0,"d":"$0.00"},false,{"v":-7.575571437941365,"d":"-757.56%"},30,{"v":0.024999999999999998,"d":"2.50%"},"Cycle 1","Cycle1-low"]
{"$rows_left_out":39}
{"sheet":"SA Risk","index":16,"n_rows":0,"n_cols":0,"rows_kept":0}

{"sheet":"wksCommandBars","index":17,"n_rows":26,"n_cols":25,"rows_kept":26,"hidden":true}
["Command Bar Name","Control Caption","Control Caption","Control Caption","Position","IsMenubar","Visible","Width","Protection","IsTemporary","IsEnabled","OnAction","Control ID","Control Type","Control Style","Face ID","Begin Group","Before","Tooltip","Shortcut Text","Tag","Parameter","State","ListRange","Lists"]
["Worksheet Menu Bar"]
[null,"&ARI",{"$nulls":11},{"$f":"msoControlPopup","v":10},{"$nulls":3},"Window"]
[null,null,"&Insert Data Table Row",{"$nulls":8},"InsertDataSheetRow",1,{"$f":"msoControlButton","v":1},{"$f":"msoButtonIconAndCaption","v":3},296,{"$nulls":3},"Ctrl+Shift+I"]
[null,null,"&Delete Data Table Row",{"$nulls":8},"DeleteDataSheetRow",1,1,3,293,{"$nulls":3},"Ctrl+Shift+D"]
[null,null,"&Remove Unused Data Rows",{"$nulls":8},"RemoveUnusedDataSheetRows",1,1,3,541,{"$nulls":3},"Ctrl+Shift+R"]
{"$rows_left_out":20}